{"text_format":"1","workbook":"xlsx","n_sheets":3,"sheets":["レイアウトシート","編集仕様1","編集仕様2"],"not_rendered":{"charts":0,"images":0,"macros":1,"external_links":0,"defined_names":1,"comments":1,"pivot_tables":0},"unopened":[],"bounds":{"document_bytes":16777216,"sheet_cells":100000,"rows_first":2000,"rows_last":500,"rows_between":2000,"halvings":0,"cell_chars":16384,"cell_head_chars":4096},"cells_cut":0,"cells_raw":0,"read":"whole","date_system":"1900"}

{"sheet":"レイアウトシート","index":0,"n_rows":339,"n_cols":67,"rows_kept":339,"cut":false,"hidden":false,"merged":[[133,2,135,7],[133,8,135,12],[133,13,135,13],[133,14,135,14],[85,4,89,8],[174,9,176,11],[174,14,176,15],[174,16,176,18],[273,54,276,64],[273,51,276,53],[204,38,207,49],[208,35,211,37],[236,54,239,64],[236,51,239,53],[228,38,231,49],[228,35,231,37],[228,54,231,64],[228,51,231,53],[232,38,235,49],[232,35,235,37],[269,51,272,53],[273,38,276,49],[257,42,260,44],[257,38,260,40],[111,16,113,16],[84,25,86,34],[84,59,86,65],[87,59,89,65],[84,55,89,58],[87,25,89,34],[281,35,284,37],[281,54,284,64],[281,51,284,53],[253,34,255,63],[277,35,280,37],[309,38,312,53],[261,35,264,63],[297,38,300,49],[297,35,300,37],[297,54,300,64],[297,51,300,53],[301,38,304,49],[1,53,3,67],[1,44,3,52],[301,35,304,37],[273,35,276,37],[277,54,280,64],[277,51,280,53],[265,54,268,64],[265,51,268,53],[269,38,272,49],[240,38,243,49],[269,35,272,37],[265,38,268,49],[265,35,268,37],[240,35,243,37],[240,54,243,64],[285,54,288,64],[285,51,288,53],[289,38,292,49],[289,35,292,37],[277,38,280,49],[289,54,292,64],[289,51,292,53],[285,38,288,49],[285,35,288,37],[301,54,304,64],[301,51,304,53],[293,35,296,37],[269,54,272,64],[240,51,243,53],[244,38,247,53],[244,35,247,37],[281,38,284,49],[257,35,260,37],[257,45,260,47],[104,25,106,26],[104,28,106,30],[108,19,113,21],[108,55,110,57],[103,37,105,39],[103,40,105,41],[103,52,105,54],[103,55,106,63],[103,64,106,65],[108,41,110,42],[108,43,110,45],[108,47,110,48],[109,28,113,31],[109,33,113,34],[111,39,113,52],[232,54,235,64],[232,51,235,53],[136,23,138,23],[62,53,66,54],[62,55,64,57],[212,38,215,49],[204,35,207,37],[216,35,219,37],[216,54,219,64],[216,51,219,53],[208,54,211,64],[236,38,239,49],[236,35,239,37],[108,49,110,51],[108,58,110,59],[99,52,101,54],[99,55,102,63],[99,64,102,65],[136,63,138,63],[136,64,138,64],[139,55,141,57],[139,58,141,62],[139,63,141,63],[139,64,141,64],[139,65,141,67],[120,53,122,54],[123,53,125,54],[108,65,110,66],[123,55,125,67],[139,43,141,43],[139,44,141,44],[139,45,141,47],[139,48,141,52],[139,53,141,53],[65,58,67,67],[100,4,102,6],[100,7,102,8],[108,4,113,6],[108,7,113,8],[92,4,94,6],[92,7,94,8],[104,4,106,6],[104,7,106,8],[80,35,89,36],[111,37,113,38],[79,29,83,31],[79,32,83,34],[111,53,113,54],[111,55,113,67],[92,25,94,26],[92,28,94,30],[74,55,79,57],[74,58,76,67],[77,58,79,67],[77,40,79,43],[99,66,102,67],[109,22,113,24],[72,4,76,5],[72,25,76,26],[80,64,83,66],[78,18,79,19],[68,58,70,67],[71,55,73,57],[71,58,73,61],[71,62,73,64],[64,40,66,41],[66,4,69,5],[80,17,82,20],[78,2,89,3],[80,37,81,38],[71,65,73,67],[13,39,15,41],[53,25,57,26],[16,37,19,38],[16,39,19,41],[60,4,63,5],[60,25,63,26],[13,4,14,10],[15,4,16,10],[17,4,18,10],[19,4,20,10],[21,4,22,10],[33,55,38,67],[55,55,60,56],[55,57,60,59],[50,64,54,65],[62,58,64,61],[62,62,64,64],[62,65,64,67],[70,4,71,5],[58,4,59,5],[53,6,57,9],[84,22,89,24],[0,25,3,43],[1,2,3,6],[1,7,3,8],[1,9,3,10],[1,11,3,12],[1,13,3,14],[1,15,3,16],[1,17,3,18],[10,18,12,24],[16,18,19,24],[20,18,22,24],[33,35,38,54],[36,22,38,30],[36,31,38,34],[39,2,51,3],[96,4,98,6],[65,55,70,57],[90,2,100,3],[90,9,91,10],[90,11,91,13],[90,14,91,15],[90,16,91,18],[90,19,91,20],[96,7,98,8],[60,6,63,9],[66,6,69,9],[72,6,76,9],[47,4,51,8],[67,40,69,43],[70,40,72,41],[72,37,75,39],[73,40,75,41],[66,25,69,26],[46,22,51,24],[46,25,48,34],[5,2,22,3],[5,18,9,24],[52,22,54,24],[7,11,8,17],[9,11,10,17],[11,11,12,17],[13,11,14,17],[15,11,16,17],[17,11,18,17],[19,11,20,17],[21,11,22,17],[16,25,19,36],[13,25,15,38],[53,4,57,5],[5,4,6,17],[49,25,51,34],[7,4,8,10],[9,4,10,10],[11,4,12,10],[52,2,77,3],[33,2,38,7],[33,8,38,21],[33,22,35,34],[40,29,44,31],[40,32,44,34],[13,18,15,24],[39,37,43,38],[55,47,60,48],[57,37,60,38],[57,39,60,40],[14,42,16,46],[45,37,49,38],[45,39,49,40],[45,46,49,46],[5,25,12,41],[5,42,13,46],[5,47,13,67],[39,46,43,46],[39,55,43,56],[39,57,43,60],[39,61,43,61],[39,62,43,64],[39,65,43,65],[45,52,49,52],[45,53,49,54],[39,66,43,67],[20,25,22,41],[28,59,31,60],[28,61,31,62],[28,63,31,64],[40,25,44,28],[20,42,22,46],[20,47,22,67],[17,57,19,58],[17,59,19,60],[17,61,19,63],[17,64,19,65],[17,66,19,67],[17,50,19,52],[17,42,19,46],[14,47,16,67],[17,53,19,54],[17,55,19,56],[24,38,28,39],[24,40,28,41],[24,44,28,57],[24,18,28,21],[24,22,28,23],[24,24,28,25],[24,26,28,27],[24,28,28,29],[24,30,28,31],[24,32,28,33],[24,34,28,35],[24,36,28,37],[28,65,31,66],[39,35,49,36],[39,52,43,52],[39,53,43,54],[40,22,44,24],[30,18,32,41],[39,39,43,40],[50,35,60,36],[50,37,53,38],[50,39,53,40],[54,38,56,39],[50,61,54,63],[50,47,54,48],[55,60,60,60],[55,61,60,63],[45,55,49,56],[45,57,49,60],[45,61,49,61],[50,66,54,67],[50,55,54,56],[50,57,54,59],[50,60,54,60],[45,62,49,64],[45,65,49,65],[45,66,49,67],[87,37,89,41],[61,35,79,36],[82,37,86,38],[85,66,89,67],[124,16,125,16],[103,66,106,67],[91,37,93,39],[91,40,93,41],[91,52,93,54],[91,55,98,63],[91,64,98,65],[91,66,98,67],[117,53,119,54],[117,55,119,67],[114,37,116,38],[114,39,116,52],[114,53,116,54],[118,33,120,34],[90,22,92,24],[90,35,107,36],[96,25,98,26],[96,28,98,30],[100,25,102,26],[100,28,102,30],[108,60,110,61],[108,63,110,64],[80,50,89,54],[114,28,116,31],[114,33,116,34],[99,37,101,39],[99,40,101,41],[80,58,83,60],[80,55,83,57],[80,61,83,63],[133,15,135,17],[133,18,135,22],[126,2,132,3],[126,22,132,23],[126,52,128,55],[126,56,128,65],[126,66,128,67],[123,37,125,38],[123,39,125,52],[133,65,135,67],[120,19,125,21],[121,22,125,27],[118,22,120,24],[130,6,132,20],[127,4,129,5],[127,6,129,17],[120,7,125,8],[108,2,125,3],[118,28,120,31],[120,37,122,38],[120,39,122,52],[114,55,116,67],[117,37,119,38],[117,39,119,52],[114,4,119,6],[114,7,119,8],[114,19,119,21],[120,55,122,67],[108,35,110,36],[108,37,110,40],[117,16,119,16],[114,22,116,24],[136,24,138,24],[136,25,138,27],[136,28,138,32],[133,53,135,53],[133,54,135,54],[133,55,135,57],[133,58,135,62],[133,63,135,63],[133,64,135,64],[133,35,135,37],[133,38,135,42],[133,43,135,43],[133,44,135,44],[133,45,135,47],[133,48,135,52],[133,23,135,23],[133,24,135,24],[133,25,135,27],[133,28,135,32],[133,33,135,33],[133,34,135,34],[139,54,141,54],[139,25,141,27],[139,28,141,32],[139,33,141,33],[139,34,141,34],[139,35,141,37],[139,38,141,42],[136,65,138,67],[139,8,141,12],[139,13,141,13],[139,14,141,14],[139,15,141,17],[139,18,141,22],[139,23,141,23],[139,24,141,24],[136,45,138,47],[136,48,138,52],[136,53,138,53],[136,54,138,54],[136,55,138,57],[136,58,138,62],[136,33,138,33],[136,34,138,34],[136,35,138,37],[136,38,138,42],[136,43,138,43],[136,44,138,44],[136,8,138,12],[136,13,138,13],[136,14,138,14],[136,15,138,17],[136,18,138,22],[145,64,147,64],[145,65,147,67],[144,3,146,6],[142,8,144,12],[142,13,144,13],[142,14,144,14],[142,15,144,17],[145,44,147,44],[145,45,147,47],[145,48,147,52],[145,53,147,53],[145,54,147,54],[145,55,147,57],[145,28,147,32],[145,33,147,33],[145,34,147,34],[145,35,147,37],[145,38,147,42],[145,43,147,43],[142,64,144,64],[142,65,144,67],[145,8,147,12],[145,13,147,13],[145,14,147,14],[145,15,147,17],[145,18,147,22],[145,23,147,23],[145,24,147,24],[145,25,147,27],[142,48,144,52],[142,53,144,53],[142,54,144,54],[154,48,156,52],[154,23,156,23],[154,24,156,24],[154,25,156,27],[148,8,150,12],[148,13,150,13],[148,14,150,14],[148,15,150,17],[148,18,150,22],[148,23,150,23],[142,55,144,57],[142,58,144,62],[142,63,144,63],[142,34,144,34],[142,35,144,37],[142,38,144,42],[142,43,144,43],[142,44,144,44],[142,45,144,47],[142,18,144,22],[142,23,144,23],[142,24,144,24],[142,25,144,27],[142,28,144,32],[142,33,144,33],[145,58,147,62],[145,63,147,63],[148,54,150,54],[148,55,150,57],[148,58,150,62],[148,63,150,63],[151,54,153,54],[154,65,156,67],[151,15,153,17],[151,18,153,22],[151,23,153,23],[157,23,159,23],[157,24,159,24],[157,25,159,27],[154,53,156,53],[154,54,156,54],[154,55,156,57],[154,58,156,62],[148,64,150,64],[148,65,150,67],[148,38,150,42],[148,43,150,43],[148,44,150,44],[148,45,150,47],[148,48,150,52],[148,53,150,53],[148,24,150,24],[148,25,150,27],[148,28,150,32],[148,33,150,33],[148,34,150,34],[148,35,150,37],[154,63,156,63],[154,64,156,64],[154,35,156,37],[154,38,156,42],[154,43,156,43],[154,44,156,44],[154,45,156,47],[151,55,153,57],[151,58,153,62],[151,63,153,63],[151,64,153,64],[151,65,153,67],[151,38,153,42],[151,43,153,43],[151,44,153,44],[151,45,153,47],[151,48,153,52],[151,53,153,53],[151,24,153,24],[151,25,153,27],[151,28,153,32],[151,33,153,33],[151,34,153,34],[151,35,153,37],[157,63,159,63],[157,64,159,64],[157,65,159,67],[160,8,162,12],[160,13,162,13],[160,14,162,14],[160,15,162,17],[160,18,162,22],[160,23,162,23],[157,44,159,44],[157,45,159,47],[157,48,159,52],[157,53,159,53],[157,54,159,54],[157,55,159,57],[157,28,159,32],[157,33,159,33],[157,34,159,34],[157,35,159,37],[157,38,159,42],[157,58,159,62],[157,43,159,43],[157,8,159,12],[157,13,159,13],[160,54,162,54],[160,55,162,57],[160,58,162,62],[160,63,162,63],[160,64,162,64],[160,65,162,67],[160,38,162,42],[160,43,162,43],[163,13,165,13],[163,54,165,54],[163,55,165,57],[163,58,165,62],[163,63,165,63],[163,64,165,64],[163,48,165,52],[163,53,165,53],[163,24,165,24],[163,25,165,27],[163,28,165,32],[163,33,165,33],[163,34,165,34],[166,65,168,67],[166,48,168,52],[166,53,168,53],[166,24,168,24],[166,25,168,27],[166,28,168,32],[166,33,168,33],[163,35,165,37],[160,44,162,44],[160,45,162,47],[160,48,162,52],[160,53,162,53],[160,24,162,24],[160,25,162,27],[160,28,162,32],[160,33,162,33],[160,34,162,34],[160,35,162,37],[174,21,176,48],[166,54,168,54],[166,55,168,57],[166,58,168,62],[166,63,168,63],[166,64,168,64],[166,38,168,42],[166,43,168,43],[166,44,168,44],[166,45,168,47],[174,64,176,67],[169,14,173,67],[163,65,165,67],[163,38,165,42],[163,43,165,43],[163,44,165,44],[166,34,168,34],[166,35,168,37],[212,2,216,20],[212,21,216,22],[212,23,216,26],[212,27,216,28],[212,29,216,32],[207,0,211,1],[207,2,211,20],[187,0,201,1],[187,2,201,9],[187,10,191,20],[187,21,191,22],[187,23,191,26],[187,27,191,28],[196,38,199,49],[196,35,199,37],[197,10,201,20],[197,21,201,22],[197,23,201,26],[197,27,201,28],[207,21,211,22],[192,27,196,28],[200,35,203,37],[188,35,191,50],[192,35,195,63],[188,54,191,56],[188,51,191,53],[188,61,191,63],[188,58,191,60],[197,29,201,32],[166,8,168,12],[166,13,168,13],[166,14,168,14],[166,15,168,17],[166,18,168,22],[166,23,168,23],[187,29,191,32],[178,23,180,41],[184,0,186,30],[184,34,186,46],[208,38,211,49],[184,56,186,63],[196,54,199,64],[196,51,199,53],[192,10,196,20],[192,21,196,22],[202,27,206,28],[202,29,206,32],[192,23,196,26],[207,27,211,28],[207,29,211,32],[200,38,203,49],[200,54,203,64],[200,51,203,53],[169,2,173,8],[169,9,173,9],[169,10,173,11],[169,12,173,12],[174,2,176,4],[174,6,176,7],[254,0,258,1],[254,2,258,20],[254,21,258,22],[254,23,258,26],[254,27,258,28],[254,29,258,32],[250,0,253,1],[250,2,253,20],[250,21,253,22],[250,23,253,26],[250,27,253,28],[250,29,253,32],[204,54,207,64],[204,51,207,53],[222,0,226,1],[222,2,226,20],[222,21,226,22],[222,23,226,26],[222,27,226,28],[222,29,226,32],[224,38,227,49],[224,35,227,37],[224,54,227,64],[224,51,227,53],[202,0,206,1],[202,2,206,20],[202,21,206,22],[202,23,206,26],[217,0,221,1],[217,2,221,20],[207,23,211,26],[217,23,221,26],[289,0,292,1],[289,2,292,20],[289,21,292,22],[289,23,292,26],[289,27,292,28],[289,29,292,32],[285,0,288,1],[285,2,288,20],[285,21,288,22],[263,0,266,1],[263,2,266,20],[263,21,266,22],[263,23,266,26],[263,27,266,28],[263,29,266,32],[259,0,262,1],[259,2,262,20],[259,21,262,22],[259,23,262,26],[259,27,262,28],[259,29,262,32],[276,0,280,1],[338,0,340,30],[320,0,322,30],[323,1,327,10],[323,11,327,12],[323,13,327,20],[323,29,327,30],[323,31,327,34],[323,21,327,22],[323,23,327,28],[305,51,308,53],[309,15,312,16],[309,17,312,22],[309,23,312,32],[313,0,317,1],[313,2,317,20],[313,21,317,22],[313,23,317,26],[313,27,317,28],[305,35,308,37],[309,35,312,37],[297,15,300,16],[297,17,300,22],[297,23,300,32],[240,21,244,22],[240,23,244,26],[240,27,244,28],[240,29,244,32],[192,29,196,32],[285,23,288,26],[285,27,288,28],[285,29,288,32],[281,2,284,20],[281,21,284,22],[281,23,284,26],[281,27,284,28],[281,29,284,32],[271,2,275,20],[271,21,275,22],[271,23,275,26],[271,27,275,28],[271,29,275,32],[267,27,270,28],[267,29,270,32],[276,2,280,17],[276,18,280,19],[276,20,280,22],[276,23,280,24],[276,25,280,27],[276,28,280,29],[276,30,280,32],[217,27,221,28],[217,29,221,32],[154,15,156,17],[154,18,156,22],[154,3,156,6],[154,8,156,12],[154,13,156,13],[154,14,156,14],[313,29,317,32],[293,0,312,1],[293,2,312,14],[330,9,335,54],[305,38,308,49],[293,54,296,64],[293,51,296,53],[181,43,183,65],[301,17,304,22],[301,23,304,32],[305,15,308,16],[305,17,308,22],[305,23,308,32],[281,0,284,1],[323,37,327,46],[323,47,327,48],[323,49,327,52],[323,53,327,54],[323,55,327,58],[305,54,308,64],[293,38,296,49],[271,0,275,1],[267,0,270,1],[267,2,270,20],[267,21,270,22],[267,23,270,26],[151,8,153,12],[151,13,153,13],[151,14,153,14],[101,2,102,3],[61,40,63,41],[63,37,66,39],[217,21,221,22],[120,4,125,6],[301,15,304,16],[293,15,296,16],[293,17,296,32],[130,24,132,45],[163,45,165,47],[40,20,46,21],[163,8,165,12],[163,14,165,14],[163,15,165,17],[163,18,165,22],[163,23,165,23],[158,5,160,7],[157,14,159,14],[157,15,159,17],[157,18,159,22],[79,4,83,5],[79,6,83,7],[40,4,45,5],[40,6,45,7],[154,28,156,32],[154,33,156,33],[154,34,156,34],[220,54,223,64],[212,35,215,37],[220,35,223,37],[212,0,216,1],[240,0,249,1],[240,2,249,20],[245,21,249,22],[245,23,249,26],[245,27,249,28],[245,29,249,32],[174,58,176,61],[227,0,231,1],[227,2,231,13],[227,14,231,16],[227,17,231,22],[227,23,231,23],[227,24,231,29],[227,30,231,32],[232,0,239,1],[232,2,239,20],[232,21,235,22],[232,23,235,26],[232,27,235,28],[232,29,235,32],[236,21,239,22],[236,23,239,32],[220,51,223,53],[216,38,219,49],[208,51,211,53],[220,38,223,49],[212,54,215,64],[212,51,215,53]]}
[null,null,null,null,null,null,null,null,null,null,null,null,null,null,null,null,null,null,null,null,null,null,null,null,null,"健康診断受診票"]
[null,null,"受診予定日",null,null,null,null,null,null,"年",null,null,null,"月",null,null,null,"日",null,null,null,null,null,null,null,null,null,null,null,null,null,null,null,null,null,null,null,null,null,null,null,null,null,null,null,null,null,null,null,null,null,null,null,"*マークは今回の受診予定項目です"]
[]
[]
[]
[null,null,"検　診　区　分",null,null,null,null,null,null,null,null,null,null,null,null,null,null,null,"健保組合",null,null,null,null,null,null,null,null,null,null,null,null,null,null,null,null,null,null,null,null,null,null,null,"所　属"]
[]
[null,null,null,null,{"$f":"IFERROR(VLOOKUP(1,#REF!,4,0),\"\")","v":""},null,null,null,null,null,null,{"$f":"IFERROR(VLOOKUP(9,#REF!,4,0),\"\")","v":""}]
[]
[null,null,null,null,{"$f":"IFERROR(VLOOKUP(2,#REF!,4,0),\"\")","v":""},null,null,null,null,null,null,{"$f":"IFERROR(VLOOKUP(10,#REF!,4,0),\"\")","v":""}]
[null,null,null,null,null,null,null,null,null,null,null,null,null,null,null,null,null,null,"会社名"]
[null,null,null,null,{"$f":"IFERROR(VLOOKUP(3,#REF!,4,0),\"\")","v":""},null,null,null,null,null,null,{"$f":"IFERROR(VLOOKUP(11,#REF!,4,0),\"\")","v":""}]
[]
[null,null,null,null,{"$f":"IFERROR(VLOOKUP(4,#REF!,4,0),\"\")","v":""},null,null,null,null,null,null,{"$f":"IFERROR(VLOOKUP(12,#REF!,4,0),\"\")","v":""},null,null,null,null,null,null,"フリガナ"]
[null,null,null,null,null,null,null,null,null,null,null,null,null,null,null,null,null,null,null,null,null,null,null,null,null,null,null,null,null,null,null,null,null,null,null,null,null,null,null,null,null,null,"生年月日"]
[null,null,null,null,{"$f":"IFERROR(VLOOKUP(5,#REF!,4,0),\"\")","v":""},null,null,null,null,null,null,{"$f":"IFERROR(VLOOKUP(13,#REF!,4,0),\"\")","v":""}]
[null,null,null,null,null,null,null,null,null,null,null,null,null,null,null,null,null,null,"氏名",null,null,null,null,null,null,null,null,null,null,null,null,null,null,null,null,null,null,"様",null,"男・女"]
[null,null,null,null,{"$f":"IFERROR(VLOOKUP(6,#REF!,4,0),\"\")","v":""},null,null,null,null,null,null,{"$f":"IFERROR(VLOOKUP(14,#REF!,4,0),\"\")","v":""},null,null,null,null,null,null,null,null,null,null,null,null,null,null,null,null,null,null,null,null,null,null,null,null,null,null,null,null,null,null,"年　齢",null,null,null,null,null,null,null,null,null,null,"年",null,null,null,"月",null,null,null,"日生",null,null,null,null,"才"]
[]
[null,null,null,null,{"$f":"IFERROR(VLOOKUP(7,#REF!,4,0),\"\")","v":""},null,null,null,null,null,null,{"$f":"IFERROR(VLOOKUP(15,#REF!,4,0),\"\")","v":""}]
{"$rows_left_out":320}
{"sheet":"編集仕様1","index":1,"n_rows":135,"n_cols":84,"rows_kept":135,"cut":false,"hidden":true,"merged":[]}
["予約日              ","2","45","0","1","1  ","1  ","1  ","1  ","0 ","                    ","0",null,null,1,"  577Z1008020                                                                                         00                                        "]
["コース枝番名称      ","6","5","0","1","1  ","1  ","1  ","1  ","0 ","                    ","0",null,null,2,"  596Z1055020                                                                                         00                                        "]
["パラメータ２        ","6","78","0","1","1  ","1  ","1  ","1  ","0 ","                    ","0",null,null,3,"S   1P1000820                                                                                         00                                        "]
["団体コード          ","6","101","0","1","1  ","1  ","1  ","1  ","0 ","                    ","0",null,null,4,"  597Z1200020                                                                                         00                                        "]
["団体漢字名称        ","6","105","0","1","1  ","1  ","1  ","1  ","0 ","                    ","0",null,null,5,"  598Z1201020                                                                                         00                                        "]
["パラメータ３        ","9","78","0","1","1  ","1  ","1  ","1  ","0 ","                    ","0",null,null,8,"S   2P1000920                                                                                         00                                        "]
["細分コード１        ","9","101","0","1","1  ","1  ","1  ","1  ","0 ","                    ","0",null,null,9,"  599Z1217020                                                                                         00                                        "]
["細分１漢字名称      ","9","105","0","1","1  ","1  ","1  ","1  ","0 ","                    ","0",null,null,10,"  600Z1218020                                                                                         00                                        "]
["健診コースコード    ","10","130","0","1","1  ","1  ","1  ","1  ","0 ","                    ","0",null,null,11,"  595Z1050020                                                                                         00                                        "]
["パラメータ４        ","12","78","0","1","1  ","1  ","1  ","1  ","0 ","                    ","0",null,null,12,"S   3P1001020                                                                                         00                                        "]
["細分コード２        ","12","101","0","1","1  ","1  ","1  ","1  ","0 ","                    ","0",null,null,13,"  601Z1234020                                                                                         00                                        "]
["細分２漢字名称      ","12","105","0","1","1  ","1  ","1  ","1  ","0 ","                    ","0",null,null,14,"  602Z1235020                                                                                         00                                        "]
["カナ氏名            ","14","26","0","1","1  ","1  ","1  ","1  ","0 ","                    ","0",null,null,15,"  587Z1025020                                                                                         00                                        "]
["性別(男・女)        ","14","40","0","1","1  ","1  ","1  ","1  ","0 ","                    ","0",null,null,16,"  589Z1031020                                                                                         00                                        "]
["パラメータ５        ","15","78","0","1","1  ","1  ","1  ","1  ","0 ","                    ","0",null,null,17,"S   4P1001120                                                                                         00                                        "]
["細分コード３        ","15","101","0","1","1  ","1  ","1  ","1  ","0 ","                    ","0",null,null,18,"  603Z1251020                                                                                         00                                        "]
["細分３漢字名称      ","15","105","0","1","1  ","1  ","1  ","1  ","0 ","                    ","0",null,null,19,"  604Z1252020                                                                                         00                                        "]
["登録番号            ","16","129","0","1","1  ","1  ","1  ","1  ","0 ","                    ","0",null,null,20,"  583Z1021020                                                                                         00                                        "]
["漢字氏名            ","17","26","0","1","1  ","1  ","1  ","1  ","0 ","                    ","0",null,null,21,"  588Z1027020                                                                                         00                                        "]
["生年月日(西暦年)    ","18","51","0","1","1  ","1  ","1  ","1  ","0 ","                    ","0",null,null,22,"  591Z1037020                                                                                         00                                        "]
{"$rows_left_out":116}
{"sheet":"編集仕様2","index":2,"n_rows":461,"n_cols":16,"rows_kept":461,"cut":false,"hidden":true,"merged":[]}
["Z1021020      0201                                                                               ",null,null,null,null,null,null,null,null,null,"1","------00                                                                                         ","0","2","ＨＢｓ抗原定性(CLIA)",59]
[{"$f":"MATCH(A1,L:L,0)","v":395},null,null,null,null,null,null,null,null,null,"2","00104013                                                                                         ","0","3","★胃部X線(直接)     ",76]
["1",null,null,null,null,null,null,null,null,null,"3","00160013                                                                                         ","0","3","★胃部X線(直接)     ",76]
["1",null,null,null,null,null,null,null,null,null,"4","00300013                                                                                         ","0","3","★胃部X線(直接)     ",76]
[null,null,null,null,null,null,null,null,null,null,"5","00500513                                                                                         ","0","3","★胃部X線(直接)     ",76]
[null,null,null,null,null,null,null,null,null,null,"6","00800000                                                                                         ","0","0","★ｱﾚﾙｷﾞｰ39          ",79]
[null,null,null,null,null,null,null,null,null,null,"7","00820000                                                                                         ","0","0","★脳梗塞ﾘｽｸﾏｰｶｰ     ",75]
[null,null,null,null,null,null,null,null,null,null,"8","00821000                                                                                         ","0","0","★脳梗塞ﾘｽｸﾏｰｶｰ     ",75]
[null,null,null,null,null,null,null,null,null,null,"9","01100013                                                                                         ","0","3","★胃部X線(直接)     ",76]
[null,null,null,null,null,null,null,null,null,null,"10","01102013                                                                                         ","0","3","★胃部X線(直接)     ",76]
[null,null,null,null,null,null,null,null,null,null,"11","01260013                                                                                         ","0","3","★胃部X線(直接)     ",76]
[null,null,null,null,null,null,null,null,null,null,"12","01400013                                                                                         ","0","3","★胃部X線(直接)     ",76]
[null,null,null,null,null,null,null,null,null,null,"13","01440013                                                                                         ","0","3","★胃部X線(直接)     ",76]
[null,null,null,null,null,null,null,null,null,null,"14","02060013                                                                                         ","0","3","★胃部X線(直接)     ",76]
[null,null,null,null,null,null,null,null,null,null,"15","02121013                                                                                         ","0","3","★胃部X線(直接)     ",76]
[null,null,null,null,null,null,null,null,null,null,"16","08001013                                                                                         ","0","3","★胃部X線(直接)     ",76]
[null,null,null,null,null,null,null,null,null,null,"17","08002013                                                                                         ","0","3","★胃部X線(直接)     ",76]
[null,null,null,null,null,null,null,null,null,null,"18","08003013                                                                                         ","0","3","★胃部X線(直接)     ",76]
[null,null,null,null,null,null,null,null,null,null,"19","08004013                                                                                         ","0","3","★胃部X線(直接)     ",76]
[null,null,null,null,null,null,null,null,null,null,"20","08005013                                                                                         ","0","3","★胃部X線(直接)     ",76]
{"$rows_left_out":441}